{"text_format":"1","workbook":"xlsx","n_sheets":29,"sheets":["Quote Summary ","Nursery","Reception","EYFS Shared","EYFS Outdoor & Play","Year 1","Year 2","KS1 Shared","Year 3","Year 4","Year 5","Year 6","KS2 Shared","SENCO","Languages","Primary Science","Computing","Robotics","Whole School Games","Design Technology","Art","Sport","Office and Display","Whole School Resources","Secondary Maths","Secondary English","Secondary Science","Science Prep","Secondary Humanities"],"not_rendered":{"charts":0,"images":1,"macros":1,"external_links":1,"defined_names":28,"comments":0,"pivot_tables":0},"unopened":[],"bounds":{"document_bytes":16777216,"sheet_cells":100000,"rows_first":2000,"rows_last":500,"rows_between":2000,"halvings":0,"cell_chars":16384,"cell_head_chars":4096},"cells_cut":0,"cells_raw":0,"read":"whole","date_system":"1900"}

{"sheet":"Quote Summary ","index":0,"n_rows":32,"n_cols":9,"rows_kept":32,"cut":false,"hidden":false,"merged":[[18,10,18,15],[18,8,18,9],[8,8,8,9],[2,8,2,15],[10,8,10,9],[12,8,12,9],[14,8,14,9],[16,8,16,9],[4,8,4,9],[6,8,6,9],[4,10,4,15],[6,10,6,15],[8,10,8,15],[10,10,10,15],[12,10,12,15],[14,10,14,15],[16,10,16,15]]}
[]
[null,"Class / Department","Total",null,"Number of Classes","Total Cost"]
[null,"Nursery",{"$f":"Nursery!G1","v":24434.330000000013},null,0,{"$f":"E3*C3","v":0},null,null,"Contact Details"]
[null,"Reception",{"$f":"Reception!G1","v":25270.240000000002},null,0,{"$f":"E4*C4","v":0}]
[null,"EYFS Shared Resource",{"$f":"'EYFS Shared'!G1","v":98911.710000000021},null,0,0,null,null,"Your Name:"]
[null,"EYFS Outdoor Play",{"$f":"'EYFS Outdoor & Play'!G1","v":87540.470000000016},null,0,0]
[null,null,null,null,null,null,null,null,"Phone Number:"]
[null,"Year 1",{"$f":"'Year 1'!H1","v":30532.510000000009},null,0,0]
{"$rows_left_out":25}
{"sheet":"Nursery","index":1,"n_rows":87,"n_cols":7,"rows_kept":87,"cut":false,"hidden":false,"merged":[[3,4,86,4],[2,0,2,6]]}
[null,null,null,null,null,"Basket Total",{"$f":"SUM(G4:G87)","v":24434.330000000013}]
["Product Code","Product Description","Units of Measure","Quantity","Section","Unit Price","Total Price"]
["FS 1 CLASSROOM"]
["HC1778191","Group Listening Package",1,1,"Nursery CLASSROOM",1170.23,{"$f":"F4*D4","v":1170.23}]
["HC72377","Wooden Spoon",1,15,null,9.4499999999999993,{"$f":"F5*D5","v":141.75}]
["HC1239842","Play Tray","EA",3,null,141.22999999999999,423.68999999999994]
["HC1239846","Tough Play Tray Stand",1,1,null,524.48,524.48]
["HC1556329","Recycled Clip Board Blue",5,4,null,120.75,483]
{"$rows_left_out":80}
{"sheet":"Reception","index":2,"n_rows":104,"n_cols":7,"rows_kept":104,"cut":false,"hidden":false,"merged":[[2,0,2,6],[3,4,49,4],[51,4,95,4],[97,4,101,4],[102,0,102,6],[96,0,96,6],[50,0,50,6]]}
[null,null,null,null,null,"Basket Total",{"$f":"SUM(G3:G104)","v":25270.240000000002}]
["Product Code","Product Description","Units of Measure","Quantity","Section","Unit Price","Total Price"]
["MATHS"]
["HC1622425","Natural Materials",1,2,null,322.88,{"$f":"F4*D4","v":645.76}]
["CP00057177","White Shells 2.5L",1,2,null,165.38,330.76]
["HC1574295","Wood Mix",1,2,null,78.23,156.46]
["HC1773398","Junior Rainbow Pebbles",36,2,null,145.43,290.86]
["HC88201368","Super Giant Numbers 108 Pcs",108,1,null,701.93,701.93]
{"$rows_left_out":97}
{"sheet":"EYFS Shared","index":3,"n_rows":124,"n_cols":7,"rows_kept":124,"cut":false,"hidden":false,"merged":[[103,4,123,4],[3,4,101,4],[2,0,2,6],[102,0,102,6]]}
[null,null,null,null,null,"Basket Total",{"$f":"SUM(G3:G124)","v":98911.710000000021}]
["Product Code","Product Description","Units of Measure","Quantity","Section","Unit Price","Total Price"]
["Early Years Shared Resources (ICT, Play, Messy-Play etc.)"]
["HC1778191","Group Listening Package",1,1,"EYS Shared Resources",1170.23,{"$f":"F4*D4","v":1170.23}]
["HC1782432","King Georgeâ€™s Castle With Knights",1,2,null,887.78,{"$f":"F5*D5","v":1775.56}]
["HC1499801","Fairy And Elf Furniture Pack",15,1,null,532.35,532.35]
["HC168681","Floor Tessellating Shapes",1,1,null,435.75,435.75]
["CP00050516","Clear Plastic Buckets - Pack of 8","PK",1,null,120.75,120.75]
{"$rows_left_out":117}
{"sheet":"EYFS Outdoor & Play","index":4,"n_rows":50,"n_cols":7,"rows_kept":50,"cut":false,"hidden":false,"merged":[[3,4,36,4],[2,0,2,6],[37,0,37,6],[38,4,49,4]]}
[null,null,null,null,null,"Basket Total",{"$f":"SUM(G3:G50)","v":87540.470000000016}]
["Product Code","Product Description","Units of Measure","Quantity","Section","Unit Price","Total Price"]
["FS Outdoor"]
["HC1775636","Wooden Spoons",3,8,"EYFS Outdoor",24.15,{"$f":"F4*D4","v":193.2}]
["HC1775654","Wooden Bowl Set",4,3,null,40.43,{"$f":"F5*D5","v":121.28999999999999}]
["HC389096","Stainless Steel Mixing Bowl","EA",8,null,48.3,386.4]
["HC1003052","Stainless Steel Sieves",3,2,null,516.6,1033.2]
["HC1710649","Metal Scoop Set - 4 Pack",4,2,null,201.6,403.2]
{"$rows_left_out":43}
{"sheet":"Year 1","index":5,"n_rows":115,"n_cols":8,"rows_kept":115,"cut":false,"hidden":false,"merged":[[94,4,109,5],[111,4,114,5],[2,0,2,7],[110,0,110,7],[93,0,93,7],[56,0,56,7],[57,4,92,5],[3,4,55,4]]}
[null,null,null,null,null,null,"Basket Total",{"$f":"SUM(H3:H115)","v":30532.510000000009}]
["Product Code","Product Description","Units of Measure","Quantity","Section","Curriculum Area","Unit Price","Total Price"]
["MATHS"]
["HC1489774","Numicon Boxed Set Of 80 Shapes",80,2,"Maths","Number and Place Value",354.9,{"$f":"G4*D4","v":709.8}]
["CP00060000","Pupil Number Fans from Hope Education Pack of 10","pack of 10 ",6,null,"Number and Place Value",105,630]
["HC1664899","BIGJIGS Toys Number Operations Drawing Templates Pack",29,1,null,"Number and Place Value",120.75,120.75]
["HC332676","0-100 Table Top Number Lines Pk5",5,4,null,"Number and Place Value",80.849999999999994,323.39999999999998]
["HC1536010","Student Number Line from Hope Education - Pack of 30",30,1,null,"Number and Place Value",152.25,152.25]
{"$rows_left_out":108}
{"sheet":"Year 2","index":6,"n_rows":133,"n_cols":8,"rows_kept":133,"cut":false,"hidden":false,"merged":[[118,4,128,5],[130,4,132,5],[101,4,116,5],[63,0,63,7],[2,0,2,7],[129,0,129,7],[117,0,117,7],[64,4,99,5],[100,0,100,7],[3,4,62,4]]}
[null,null,null,null,null,null,"Basket Total",{"$f":"SUM(H3:H133)","v":34691.640000000021}]
["Product Code","Product Description","Units of Measure","Quantity","Section","Curriculum Area","Unit Price","Total Price"]
["MATHS"]
["HC1489774","Numicon Boxed Set Of 80 Shapes",80,2,"Maths","Number and Place Value",354.9,{"$f":"G4*D4","v":709.8}]
["CP00060000","Pupil Number Fans from Hope Education Pack of 10","pack of 10 ",6,null,"Number and Place Value",105,{"$f":"G5*D5","v":630}]
["HC1664899","BIGJIGS Toys Number Operations Drawing Templates Pack",29,1,null,"Number and Place Value",120.75,120.75]
["HC332676","0-100 Table Top Number Lines Pk5",5,4,null,"Number and Place Value",80.849999999999994,323.39999999999998]
["HC1536010","Student Number Line from Hope Education - Pack of 30",30,1,null,"Number and Place Value",152.25,152.25]
{"$rows_left_out":126}
{"sheet":"KS1 Shared","index":7,"n_rows":129,"n_cols":8,"rows_kept":129,"cut":false,"hidden":false,"merged":[[120,4,128,5],[119,0,119,7],[2,0,2,7],[55,0,55,7],[3,4,54,4],[63,0,63,7],[56,4,62,5],[64,4,118,5]]}
[null,null,null,null,null,null,"Basket Total",{"$f":"SUM(H3:H129)","v":57327.950000000004}]
["Product Code","Product Description","Units of Measure","Quantity","Section","Curriculum Area","Unit Price","Total Price"]
["MATHS"]
["E8R06581"," Classmates Craft Sticks Plain - Pack of 1000",null,1,"Maths","Number and Place Value",68.78,{"$f":"G4*D4","v":68.78}]
["EFMT14681"," Ten Frames Classroom Set",null,1,null,"Number and Place Value",234.15,234.15]
["HC1002642"," Dinosaur Counters in Jar - Pack 128",null,1,null,"Number and Place Value",88.73,88.73]
["HC1579905"," Farm Animal Counters - Pack 144",null,1,null,"Number and Place Value",169.58,169.58]
["EFMT12398"," Assorted Coloured Dice - Pack 100",null,1,null,"Number and Place Value",48.3,48.3]
{"$rows_left_out":122}
{"sheet":"Year 3","index":8,"n_rows":135,"n_cols":8,"rows_kept":135,"cut":false,"hidden":false,"merged":[[117,4,129,5],[131,4,134,5],[2,0,2,7],[130,0,130,7],[116,0,116,7],[63,0,63,7],[99,0,99,7],[100,4,115,5],[64,4,98,5],[3,4,62,4]]}
[null,null,null,null,null,null,"Basket Total",{"$f":"SUM(H3:H135)","v":37991.950000000012}]
["Product Code","Product Description","Units of Measure","Quantity","Section","Curriculum Area","Unit Price","Total Sell"]
["MATHS"]
["HC169149","Htu Dice Pack Of 60",60,1,"Maths","Number and Place Value",403.2,{"$f":"G4*D4","v":403.2}]
["HC1369266","Place Value Arrows Thousands Teacher",9,2,null,"Number and Place Value",108.68,{"$f":"G5*D5","v":217.36}]
["HC1002791","Place Value Arrow Cards Pupil PK6",6,3,null,"Number and Place Value",290.33,{"$f":"G6*D6","v":870.99}]
["HC1489774","Numicon Boxed Set Of 80 Shapes",80,2,null,"Number and Place Value",354.9,{"$f":"G7*D7","v":709.8}]
["CP00060000","Pupil Number Fans from Hope Education Pack of 10","pack of 10 ",6,null,"Number and Place Value",105,630]
{"$rows_left_out":128}
{"sheet":"Year 4","index":9,"n_rows":130,"n_cols":8,"rows_kept":130,"cut":false,"hidden":false,"merged":[[127,0,127,7],[119,4,126,5],[128,4,129,5],[2,0,2,7],[118,0,118,7],[65,0,65,7],[66,4,100,5],[101,0,101,7],[102,4,117,5],[3,4,64,4]]}
[null,null,null,null,null,null,"Basket Total",{"$f":"SUM(H3:H130)","v":36407.4}]
["Product Code","Product Description","Units of Measure","Quantity","Section","Curriculum Area","Unit Price","Total Price"]
["MATHS"]
["HC169149","Htu Dice Pack Of 60",60,1,"Maths","Number and Place Value",403.2,{"$f":"G4*D4","v":403.2}]
["HC1369266","Place Value Arrows Thousands Teacher",9,2,null,"Number and Place Value",108.68,217.36]
["HC1002791","Place Value Arrow Cards Pupil PK6",6,3,null,"Number and Place Value",290.33,870.99]
["HC1489774","Numicon Boxed Set Of 80 Shapes",80,2,null,"Number and Place Value",354.9,709.8]
["HC332676","0-100 Table Top Number Lines Pk5",5,4,null,"Number and Place Value",80.849999999999994,323.39999999999998]
{"$rows_left_out":123}
{"sheet":"Year 5","index":10,"n_rows":130,"n_cols":8,"rows_kept":130,"cut":false,"hidden":false,"merged":[[127,0,127,7],[128,4,129,5],[119,4,126,5],[2,0,2,7],[65,0,65,7],[118,0,118,7],[66,4,100,5],[101,0,101,7],[102,4,117,5],[3,4,64,4]]}
[null,null,null,null,null,null,"Basket Total",{"$f":"SUM(H3:H130)","v":36407.4}]
["Product Code","Product Description","Units of Measure","Quantity","Section","Curriculum Area","Unit Price","Total Price"]
["MATHS"]
["HC169149","Htu Dice Pack Of 60",60,1,"Maths","Number and Place Value",403.2,{"$f":"G4*D4","v":403.2}]
["HC1369266","Place Value Arrows Thousands Teacher",9,2,null,"Number and Place Value",108.68,217.36]
["HC1002791","Place Value Arrow Cards Pupil PK6",6,3,null,"Number and Place Value",290.33,870.99]
["HC1489774","Numicon Boxed Set Of 80 Shapes",80,2,null,"Number and Place Value",354.9,709.8]
["HC332676","0-100 Table Top Number Lines Pk5",5,4,null,"Number and Place Value",80.849999999999994,323.39999999999998]
{"$rows_left_out":123}
{"sheet":"Year 6","index":11,"n_rows":130,"n_cols":8,"rows_kept":130,"cut":false,"hidden":false,"merged":[[127,0,127,7],[128,4,129,5],[119,4,126,5],[2,0,2,7],[118,0,118,7],[65,0,65,7],[66,4,100,5],[101,0,101,7],[102,4,117,5],[3,4,64,4]]}
[null,null,null,null,null,null,"Basket Total",{"$f":"SUM(H3:H130)","v":36407.4}]
["Product Code","Product Description","Units of Measure","Quantity","Section","Curriculum Area","Unit Price","Total Price"]
["MATHS"]
["HC169149","Htu Dice Pack Of 60",60,1,"Maths","Number and Place Value",403.2,{"$f":"G4*D4","v":403.2}]
["HC1369266","Place Value Arrows Thousands Teacher",9,2,null,"Number and Place Value",108.68,217.36]
["HC1002791","Place Value Arrow Cards Pupil PK6",6,3,null,"Number and Place Value",290.33,870.99]
["HC1489774","Numicon Boxed Set Of 80 Shapes",80,2,null,"Number and Place Value",354.9,709.8]
["HC332676","0-100 Table Top Number Lines Pk5",5,4,null,"Number and Place Value",80.849999999999994,323.39999999999998]
{"$rows_left_out":123}
{"sheet":"KS2 Shared","index":12,"n_rows":97,"n_cols":8,"rows_kept":97,"cut":false,"hidden":false,"merged":[[87,4,96,5],[38,4,46,4],[3,4,36,4],[48,4,60,4],[2,0,2,7],[47,0,47,7],[37,0,37,7],[61,0,61,7],[86,0,86,7],[62,4,85,5]]}
[null,null,null,null,null,null,"Basket Total",{"$f":"SUM(H3:H97)","v":66932.540000000023}]
["Product Code","Product Description","Units of Measure","Quantity","Section","Curriculum Area","Unit Price ","Total Price"]
["Maths (Shared Resources)"]
["CP00052984","Place Value Counters (ones, tens, hundreds)",300,2,null,"Number and place value",210,{"$f":"G4*D4","v":420}]
["HC373964","Number Tiles",24,1,null,"Number and place value",330.75,{"$f":"G5*D5","v":330.75}]
["HC165405","1000pk Counting Sticks",1000,3,null,"Number and place value",185.33,{"$f":"G6*D6","v":555.99}]
["HC1673805","50 Place Value Activities Pack of fifty",50,1,null,"Number and place value",137.03,{"$f":"G7*D7","v":137.03}]
["HC1673815","50 Time Activities Pack of fifty",50,1,null,"Measurement",137.03,{"$f":"G8*D8","v":137.03}]
{"$rows_left_out":90}
{"sheet":"SENCO","index":13,"n_rows":76,"n_cols":6,"rows_kept":76,"cut":false,"hidden":false,"merged":[[34,0,34,5],[63,0,63,5],[56,0,56,5],[2,0,2,5],[3,0,3,5],[7,0,7,5],[19,0,19,5],[29,0,29,5]]}
[null,null,null,null,"Basket Total",{"$f":"SUM(F3:F76)","v":22977.51}]
["Product Code","Product Description","Units of Measure","Quantity","Unit Price","Total Price"]
["SENCO/INCLUSION"]
["Top 3 Books for Teachers"]
["EAMT12586","Target Ladders: Autistic Spectrum",1,1,195.83,{"$f":"E5*D5","v":195.83}]
["EGMT13773","How to Support Pupils with Autism Spectrum Condition in Primary School",1,1,187.43,{"$f":"E6*D6","v":187.43}]
["EDMT14158","Stories That Explain",1,1,162.75,{"$f":"E7*D7","v":162.75}]
["Social Communication & Social Interaction"]
{"$rows_left_out":69}
{"sheet":"Languages","index":14,"n_rows":22,"n_cols":6,"rows_kept":22,"cut":false,"hidden":false,"merged":[[15,0,15,5],[17,0,17,5],[12,0,12,5],[2,0,2,5],[3,0,3,5],[6,0,6,5],[8,0,8,5]]}
[null,null,null,null,"Basket Total",{"$f":"SUM(F3:F22)","v":5709.3899999999994}]
["Product Code","Product Description","Units of Measure","Quantity","Unit Price","Total Price"]
["Languages"]
["EYFS French"]
["HC1685173","French Dice Cards - Colour-Number","EA",1,80.849999999999994,{"$f":"D5*E5","v":80.849999999999994}]
["HC1422688","Mr. Face","EA",1,210,{"$f":"D6*E6","v":210}]
["KS1 French"]
["HC336628","Key Stage 1 French Treasure Chest","EA",1,1775.55,1775.55]
{"$rows_left_out":15}
{"sheet":"Primary Science","index":15,"n_rows":140,"n_cols":7,"rows_kept":140,"cut":false,"hidden":false,"merged":[[2,0,2,6]]}
[null,null,null,null,null,"Basket Total",{"$f":"SUM(G3:G140)","v":90102.449999999968}]
["Product Code","Product Description","Units of Measure","Quantity","Curriculum Area","Unit Price","Total Price"]
["Science"]
["HC1798425","Seasonal Change Mat",1,1,"Seasonal Changes",770.7,{"$f":"D4*F4","v":770.7}]
["HC193797","Weather Kit",1,1,"Seasonal Changes",1160.25,1160.25]
["HC1002915"," Foldaway Flower",null,1,"Plants",220.5,{"$f":"D6*F6","v":220.5}]
["E8R05674"," See-Through Compost Containers",null,1,"Plants",455.7,{"$f":"D7*F7","v":455.7}]
["CP00053351","Sunflower Seeds","PK",5,"Plants",105,{"$f":"D8*F8","v":525}]
{"$rows_left_out":133}
{"sheet":"Computing","index":16,"n_rows":14,"n_cols":7,"rows_kept":14,"cut":false,"hidden":false,"merged":[[2,0,2,6],[3,4,13,4]]}
[null,null,null,null,null,"Basket Total",{"$f":"SUM(G3:G14)","v":33747.600000000006}]
["Product Code","Product Description","Units of Measure","Quantity","Section","Unit price","Total Price"]
["Computing & I.C.T"]
["IRTP11411","Marvellous Mobiles from Hope Education Pack of six",6,5,"Computing & I.C.T",1251.08,{"$f":"F4*D4","v":6255.4}]
["HC1407724","Talking Tiles 80 Sec Pack Of 6",6,4,null,443.63,1774.52]
["CP00053326","Talking Tins 40 Seconds","EA",10,null,76.650000000000006,766.5]
["HC1789767","Talking Products Photo Album Deluxe - 130 Minutes","EA",5,null,391.13,1955.65]
["CP00050030","EaRL V2","EA",18,null,459.9,8278.1999999999989]
{"$rows_left_out":7}
{"sheet":"Robotics","index":17,"n_rows":17,"n_cols":7,"rows_kept":17,"cut":false,"hidden":false,"merged":[[2,0,2,6],[3,4,5,4],[6,4,15,4]]}
[null,null,null,null,null,"Basket Total",{"$f":"SUM(G3:G17)","v":70818.320000000007}]
["Product Code","Product Description","Units of Measure","Quantity","Section","Unit price","Total Price"]
["Computing & I.C.T"]
["HC1678200","Cubetto from Primo Toys",1,15,"EYFS/KS1 Robotics",1613.85,{"$f":"F4*D4","v":24207.75}]
["HC1758939","Cubetto Blue Ocean Adventure Map from Primo Toys",1,15,null,234.15,3512.25]
["HC1758931","Cubetto Logic Pack from Primo Toys",1,15,null,225.75,3386.25]
["CP00050030","EaRL V2","EA",18,"EYFS/KS1/KS2 Robotics",459.9,{"$f":"F7*D7","v":8278.1999999999989}]
["HC1778406","EaRL Cross-curricular Pack from Hope Education","Pack (Also in Computing)",1,null,3756.9,{"$f":"F8*D8","v":3756.9}]
{"$rows_left_out":10}
{"sheet":"Whole School Games","index":18,"n_rows":14,"n_cols":6,"rows_kept":14,"cut":false,"hidden":false,"merged":[[2,0,2,5]]}
[null,null,null,null,"Basket Total",{"$f":"SUM(F3:F14)","v":6101.09}]
["Product Code","Product Description","Units of Measure","Quantity","Unit Price","Total Price"]
["CP Yr 1 to 6"]
["HC1003695","Jumbo Dominoes",1,1,193.73,{"$f":"E4*D4","v":193.73}]
["HC1674294","Chess Board Game",1,10,88.73,887.30000000000007]
["HC1550184","Jumbo Eyedroppers",6,1,105,105]
["HC1808606","Rainbow Tongs",6,1,80.849999999999994,80.849999999999994]
["HC342842","Easy Grip Tweezers PK12",12,1,105,105]
{"$rows_left_out":7}
{"sheet":"Design Technology","index":19,"n_rows":67,"n_cols":7,"rows_kept":67,"cut":false,"hidden":false,"merged":[[3,4,37,4],[2,0,2,6],[39,4,66,4],[38,0,38,6]]}
[null,null,null,null,null,"Basket Total",{"$f":"SUM(G3:G67)","v":86359.950000000041}]
["Product Code","Product Description","Units of Measure","Quantity","Section","Unit Price","Total Price"]
["Design & Technology (Junior)"]
["HC1496660","Cork Tops",50,10,"Design & Technology",56.18,{"$f":"F4*D4","v":561.79999999999995}]
["HC880133","Dowel - 4mm",100,50,null,72.45,{"$f":"F5*D5","v":3622.5}]
["HC262086","Square Strip Balsa Pack",1,10,null,314.48,3144.8]
["HC48493510","Resource Pack For Workstations",1,3,null,2493.75,7481.25]
["HC304856","Bench Hook - Small",10,2,null,266.18,532.36]
{"$rows_left_out":60}
{"sheet":"Art","index":20,"n_rows":91,"n_cols":7,"rows_kept":91,"cut":false,"hidden":false,"merged":[[3,4,90,4],[2,0,2,6]]}
[null,null,null,null,null,"Basket Total",{"$f":"SUM(G3:G91)","v":92085.080000000016}]
["Product Code","Product Description","Units of Measure","Quantity","Section","Unit Price ","Total Price"]
["ART"]
["HC1794249","Nylon Smocks - Small","EA",30,"ART",42.53,{"$f":"F4*D4","v":1275.9000000000001}]
["HC1794251","Nylon Smocks - Medium","EA",30,null,42.53,{"$f":"F5*D5","v":1275.9000000000001}]
["HC157332","Hog Hair Round Classpack of 200",200,5,null,500.85,2504.25]
["HC136025","White Sable Brush Assortment Pk50",50,2,null,185.33,370.66]
["HC1828864","Specialist Crafts Charcoal Budget Pack",1,1,null,35.18,35.18]
{"$rows_left_out":84}
{"sheet":"Sport","index":21,"n_rows":84,"n_cols":6,"rows_kept":84,"cut":false,"hidden":false,"merged":[[2,0,2,5]]}
[null,null,null,null,"Basket Total",{"$f":"SUM(F3:F84)","v":188154.82}]
["Product Code","Product Description","Units of Measure","Quantity","Unit Price","Total Price"]
["SPORT"]
["IAAD79463"," Eveque Pacesetter1/2m Hurdle Pack",null,1,{"$f":"VLOOKUP(A4,[1]Sheet1!$A:$F,6,FALSE)","v":1613.85},{"$f":"E4*D4","v":1613.85}]
["ITNP08644"," Zsig® 19in Tennis Racquet",null,20,{"$f":"VLOOKUP(A5,[1]Sheet1!$A:$F,6,FALSE)","v":129.15},2583]
["CP058303AB","Mitre Pro Training Bib - Green - Small Senior (M-L)","EA",15,{"$f":"VLOOKUP(A6,[1]Sheet1!$A:$F,6,FALSE)","v":32.03},480.45000000000005]
["IHKP11570","Large Dimple Balls Pack Of 4","P 4",7,{"$f":"VLOOKUP(A7,[1]Sheet1!$A:$F,6,FALSE)","v":105},735]
["IRGH05457"," Agility Ladder - 4m",null,2,{"$f":"VLOOKUP(A8,[1]Sheet1!$A:$F,6,FALSE)","v":137.03},274.06]
{"$rows_left_out":77}
{"sheet":"Office and Display","index":22,"n_rows":33,"n_cols":7,"rows_kept":33,"cut":false,"hidden":false,"merged":[[29,4,32,4],[3,4,27,4],[2,0,2,6],[28,0,28,6]]}
[null,null,null,null,null,"Basket Total",{"$f":"SUM(G3:G33)","v":32995.090000000004}]
["Product Code","Product Description","Units of Measure","Quantity","Section","Unit Price","Total Price"]
["Office & Admin Stationery"]
["HC1699057","Classmate Tape Dispenser",1,10,"Office & Admin Stationery",45.68,{"$f":"F4*D4","v":456.8}]
["HC397442","C M Easytear Tape 24mmx66m Pk6",6,5,null,37.28,{"$f":"F5*D5","v":186.4}]
["HC1109952","Blu Tack Original 120g",12,10,null,105,1050]
["CP053409AC","Classmates Ballpoint Pen - Pack of 50 - Black",50,6,null,30.45,182.7]
["CP053409AF","Classmates Ballpoint Pen - Pack of 50 - Blue",50,6,null,30.45,182.7]
{"$rows_left_out":26}
{"sheet":"Whole School Resources","index":23,"n_rows":51,"n_cols":7,"rows_kept":51,"cut":false,"hidden":false,"merged":[[2,0,2,6],[3,4,26,4],[27,0,27,6]]}
[null,null,null,null,null,"Basket Total",{"$f":"SUM(G3:G51)","v":28290.980000000014}]
["Product Code","Product Description","Units of Measure","Quantity","Section","Unit Price","Total Price"]
["Bulk Buy KS2"]
["HC1000440","Ancient Egypt Photopack",1,1,"Whole School Supplies",261.98,{"$f":"F4*D4","v":261.98}]
["HC1671996","Roman Archeology Pack",1,1,null,435.75,435.75]
["HC1247350","A4 Plain whiteboards, pens and erasers",100,3,null,1493.1,4479.2999999999993]
["HC1778191","Group Listening Package",1,3,null,1170.23,3510.69]
["HC1774082","Berol Handwriting Pen - Blue",200,2,null,492.45,984.9]
{"$rows_left_out":44}
{"sheet":"Secondary Maths","index":24,"n_rows":81,"n_cols":8,"rows_kept":81,"cut":false,"hidden":false,"merged":[[2,0,2,7],[52,0,52,7],[53,4,80,5],[3,4,51,4]]}
[null,null,null,null,null,null,"Basket Total",{"$f":"SUM(H3:H81)","v":18754.620000000003}]
["Product Code","Product Description","Units of Measure","Quantity","Section","Curriculum Area","Unit Price","Total Price"]
["MATHS"]
["HC1369266","Place Value Arrows Thousands Teacher",9,2,"Maths","Number and Place Value",108.68,{"$f":"G4*D4","v":217.36}]
["HC1489774","Numicon Boxed Set Of 80 Shapes",80,2,null,"Number and Place Value",354.9,709.8]
["HC332676","0-100 Table Top Number Lines Pk5",5,4,null,"Number and Place Value",80.849999999999994,323.39999999999998]
["EFMT14690","A5 Double Sided Multiplication Grid - Pack of 35",35,1,null,"Multiplication and Division",169.58,169.58]
["HC170930","Table Boards Class Pack",1,1,null,"Multiplication and Division",258.3,258.3]
{"$rows_left_out":74}
{"sheet":"Secondary English","index":25,"n_rows":35,"n_cols":7,"rows_kept":35,"cut":false,"hidden":false,"merged":[[3,4,30,4],[2,0,2,6],[31,0,31,6],[32,4,34,4]]}
[null,null,null,null,null,"Basket Total",{"$f":"SUM(G3:G35)","v":8988.6699999999983}]
["Product Code","Product Description","Units of Measure","Quantity","Section","Unit Price","Total Price"]
["STATIONERY"]
["HC337213","Staedtler Noris HB Pencils Pk150",150,1,"Stationery",133.35,{"$f":"F4*D4","v":133.35}]
["HC1694632","Classmate Classroom Collection",9,1,null,129.15,129.15]
["HC206745","A4 Bulky Zip Wallets Asst P100",100,1,null,347.03,347.03]
["HC255469","A5 Zip Wallets Red P25",25,3,null,112.88,338.64]
["HC284654","CM Address Labels 89x36mm P250",250,2,null,24.15,48.3]
{"$rows_left_out":28}
{"sheet":"Secondary Science","index":26,"n_rows":172,"n_cols":8,"rows_kept":172,"cut":false,"hidden":false,"merged":[[2,0,2,7],[138,0,138,7],[139,4,171,5]]}
[null,null,null,null,null,null,"Basket Total",{"$f":"SUM(H3:H172)","v":165003.92999999996}]
["Product Code","Product Description","Units of Measure","Quantity","Section","Curriculum Area","Unit Price","Total Price"]
["SCIENCE"]
["E8R06048","Electronic Water Bath","each",1,null,"Biology",3861.38,{"$f":"G4*D4","v":3861.38}]
["CP058255AC","Test Tubes","Pack of 100",1,null,"Biology",152.25,152.25]
["HC1007879","Z Pattern Test Tube Stand - 200 x 125 x 75mm","EA",20,null,"Biology",24.68,493.6]
["CP00060093"," Steel Test Tube Holder - Accepts tubes up to 40mm diameter",10,2,null,"Biology",32.03,64.06]
["E8R07839","Polyprop Tiles","P10",2,null,"Biology",79.8,159.6]
{"$rows_left_out":165}
{"sheet":"Science Prep","index":27,"n_rows":96,"n_cols":7,"rows_kept":96,"cut":false,"hidden":false,"merged":[[2,0,2,6],[3,4,95,4]]}
[null,null,null,null,null,"Basket Total",{"$f":"SUM(G3:G96)","v":135255.92999999996}]
["Product Code","Product Description","Units of Measure","Quantity","Section","Unit Price","Total Price"]
["SCIENCE"]
["E8R05184","Equipment Trolley (Single Column)","each",1,"Science Prep",1694.7,{"$f":"F4*D4","v":1694.7}]
["E8R05180","Equipment Trolley (Double Column)","each",1,null,2178.75,2178.75]
["E8R05178","Equipment Trolley (Three tier)","each",1,null,2622.9,2622.9]
["E8R05100","Gratnells Trays (shallow)","Pack of 10",2,null,315,630]
["E8A88808","Gratnells Trays (deep)","each",10,null,44.1,441]
{"$rows_left_out":89}
{"sheet":"Secondary Humanities","index":28,"n_rows":34,"n_cols":7,"rows_kept":34,"cut":false,"hidden":false,"merged":[[31,0,31,6],[3,4,30,4],[2,0,2,6],[32,4,33,4]]}
[null,null,null,null,null,"Basket Total",{"$f":"SUM(G3:G34)","v":7339.6499999999987}]
["Product Code","Product Description","Units of Measure","Quantity","Section","Unit Price","Total Price"]
["STATIONERY"]
["HC337213","Staedtler Noris HB Pencils Pk150",150,1,"Stationery",133.35,{"$f":"F4*D4","v":133.35}]
["HC1694632","Classmate Classroom Collection",9,1,null,129.15,129.15]
["HC206745","A4 Bulky Zip Wallets Asst P100",100,1,null,347.03,347.03]
["HC255469","A5 Zip Wallets Red P25",25,3,null,112.88,338.64]
["HC284654","CM Address Labels 89x36mm P250",250,2,null,24.15,48.3]
{"$rows_left_out":26}